{"text_format":"1","workbook":"xlsx","n_sheets":5,"sheets":["Blindata Output","Inputs","Track Export 1","Track Export 2","Track Export 3"],"not_rendered":{"charts":0,"images":0,"macros":1,"external_links":1,"defined_names":2,"comments":0,"pivot_tables":0},"unopened":[],"bounds":{"document_bytes":16777216,"sheet_cells":100000,"rows_first":2000,"rows_last":500,"rows_between":2000,"halvings":0,"cell_chars":16384,"cell_head_chars":4096},"cells_cut":0,"cells_raw":0,"read":"whole","date_system":"1900"}

{"sheet":"Blindata Output","index":0,"n_rows":2,"n_cols":21,"rows_kept":2,"cut":false,"hidden":false,"merged":[]}
["Heading","Order Number","Blind Type","Blind Number","Customer","Location","Measured Width","Measured Drop","Fabric Colour","Inside / Outside Fit","Control Side","Stack Direction","Bracket Type","Control Drop","Despatch Method","Customer Reference","Fabric Drop","Head Track Length","Chain Length","Cord Length","Total Blades"]
["Blindata Field","'Order Number'","'Blind Type' e.g. BO, SS, TH","the number where the Blinds sits in the Order e.g. 15 (same as for 'Order Sheet #' in the Works Order)","if Customer =incl tax, then = Contact Name, else if Customer = excl tax then = Customer Name","'Location'","'Width' in Order Entry Screen","'Drop' in Order Entry Screen","'Fabric' in Order Entry Screen","Link Option 'Inside / Outside Fit","Link Option 'Control Side'","Link Option 'Stack Direction'","Link Option 'Bracket Type'","'Control Drop' in Cutting Options","'Despatch Method'","'Customer Reference'","'Fabric Drop' in Cutting Options","'Head Track Length' in Cutting Options","'Chain Length' in Cutting Options","'Cord Length' in Cutting Options","'Total Blades' as used in Works Order"]

{"sheet":"Inputs","index":1,"n_rows":72,"n_cols":29,"rows_kept":72,"cut":false,"hidden":false,"merged":[[9,16,10,16],[9,27,10,27],[9,18,10,18],[9,17,10,17],[9,21,10,21],[9,22,9,23],[9,24,9,25],[9,20,10,20],[9,19,10,19],[51,1,70,1],[11,1,30,1],[31,1,50,1],[9,12,9,13],[9,14,9,15],[9,11,10,11]]}
[null,null,"MR BLINDS VERTICAL BLIND DATA INPUT / OUTPUT",null,null,null,null,null,null,null,null,null,null,null,null,null,null,null,null,null,null,null,null,null,null,null,null,null,{"$f":"LEN(AC12)","v":0}]
[]
[]
[null,null,null,null,null,null,null,null,null,null,null,null,null,null,null,null,null,null,null,null,null,null,null,null,null,null,null,null,{"$f":"[1]Database!$T$3","v":19}]
[null,null,null,null,null,null,null,null,null,null,null,null,null,null,null,null,null,null,null,null,null,null,null,null,null,null,null,null,{"$f":"[1]Database!$U$3","v":20}]
[null,null,null,null,null,null,null,null,null,null,null,null,null,null,null,null,null,null,null,null,null,null,null,null,null,null,null,null,{"$f":"[1]Database!$Y$3","v":24}]
[null,null,null,null,null,null,null,null,null,null,null,null,null,null,null,null,null,null,null,null,null,null,null,null,null,null,null,null,{"$f":"[1]Database!$AA$3","v":26}]
[null,null,null,null,null,null,null,null,null,null,null,null,null,null,null,null,null,null,null,null,null,null,null,null,null,null,null,null,{"$f":"[1]Database!$AB$3","v":27}]
[null,null,null,null,null,null,null,null,null,null,null,{"$f":"[1]Database!$L$3-3","v":8},{"$f":"[1]Database!$W$3","v":22},{"$f":"[1]Database!$X$3","v":23},"CALC","CALC",{"$f":"[1]Database!$AH$3","v":33},{"$f":"[1]Database!$T$3","v":19},{"$f":"[1]Database!$Z$3","v":25},{"$f":"[1]Database!$AT$3-3","v":42},null,null,null,null,null,null,{"$f":"[1]Database!$AF$3","v":31}]
[null,null,null,null,null,null,null,null,null,null,null,"Customer Name","Window",null,"Adjusted",null,"Bracket Type","Blind #","Fabric Colour","Despatch Type","Prod. Bin","Blind Code","Window",null,"Adjusted",null,"Bottom Rail Type","Track Length","Track Decsription"]
[null,null,"Load Order","Invoice Number","Blind Type","Blind #","Colour","Width","Drop","Blind Code",null,null,"Width","Drop","Track Length","Fabric Drop",null,null,null,null,null,null,"Width","Drop","Width","Drop","Type | Colour | Install",null,"Blind# | Room | Ins-Out Fit | Control Side |  Stack Dirn"]
[null,"Export File #1",1,null,{"$f":"IF(ISBLANK(D12),\"\",\"VB\")","v":""},null,{"$f":"IF(S12<>\"\",UPPER(S12),\"\")","v":""},{"$f":"M12","v":""},{"$f":"N12","v":""},{"$f":"IF(D12<>\"\",$D12&\"-\"&E12&F12,\"\")","v":""},null,{"$f":"IF($J12<>\"\",VLOOKUP($D12,[1]Database!$E$6:$BI$15000,L$9,0),\"\")","v":""},{"$f":"IF($J12<>\"\",VLOOKUP($J12,[1]Database!$B$6:$BI$15000,M$9,0),\"\")","v":""},{"$f":"IF($J12<>\"\",VLOOKUP($J12,[1]Database!$B$6:$BI$15000,N$9,0),\"\")","v":""},{"$f":"IF($J12<>\"\",M12+'[1]Calc Inputs'!$D$20,\"\")","v":""},{"$f":"IF($J12<>\"\",N12+'[1]Calc Inputs'!$D$24,\"\")","v":""},{"$f":"IF($J12<>\"\",VLOOKUP($J12,[1]Database!$B$6:$BI$15000,Q$9,0),\"\")","v":""},{"$f":"IF($J12<>\"\",VLOOKUP($J12,[1]Database!$B$6:$BI$15000,R$9,0),\"\")","v":""},{"$f":"IF($J12<>\"\",VLOOKUP($J12,[1]Database!$B$6:$BI$15000,S$9,0),\"\")","v":""},{"$f":"IF($J12<>\"\",VLOOKUP($D12,[1]Database!$E$6:$BI$15000,T$9,0),\"\")","v":""},null,{"$f":"UPPER(IF(J12<>\"\",D12&\"-\"&LEFT(L12,11),\"\"))","v":""},{"$f":"IF($J12<>\"\",$M12,\"\")","v":""},{"$f":"IF($J12<>\"\",$N12,\"\")","v":""},{"$f":"IF($J12<>\"\",$O12,\"\")","v":""},{"$f":"IF($J12<>\"\",$P12,\"\")","v":""},{"$f":"UPPER(IF($J12<>\"\",$E12&\"-\"&$S12&\"-\"&LEFT($T12,7),\"\"))","v":""},{"$f":"Y12","v":""},{"$f":"UPPER(IF($J12<>\"\",\nVLOOKUP($J12,[1]Database!$B$6:$BI$15000,AC$4,0)&\"-\"&\nVLOOKUP($J12,[1]Database!$B$6:$BI$15000,AC$5,0)&\"-\"&\nVLOOKUP($J12,[1]Database!$B$6:$BI$15000,AC$6,0)&\"-\"&\nVLOOKUP($J12,[1]Database!$B$6:$BI$15000,AC$7,0)&\"-\"&\nVLOOKUP($J12,[1]Database!$B$6:$BI$15000,AC$8,0),\n\"\"))","v":""}]
[null,null,2,null,"",null,"","","","",null,{"$f":"IF($J13<>\"\",VLOOKUP($D13,[1]Database!$E$6:$BI$15000,L$9,0),\"\")","v":""},{"$f":"IF($J13<>\"\",VLOOKUP($J13,[1]Database!$B$6:$BI$15000,M$9,0),\"\")","v":""},{"$f":"IF($J13<>\"\",VLOOKUP($J13,[1]Database!$B$6:$BI$15000,N$9,0),\"\")","v":""},{"$f":"IF($J13<>\"\",M13+'[1]Calc Inputs'!$D$20,\"\")","v":""},{"$f":"IF($J13<>\"\",N13+'[1]Calc Inputs'!$D$24,\"\")","v":""},{"$f":"IF($J13<>\"\",VLOOKUP($J13,[1]Database!$B$6:$BI$15000,Q$9,0),\"\")","v":""},{"$f":"IF($J13<>\"\",VLOOKUP($J13,[1]Database!$B$6:$BI$15000,R$9,0),\"\")","v":""},{"$f":"IF($J13<>\"\",VLOOKUP($J13,[1]Database!$B$6:$BI$15000,S$9,0),\"\")","v":""},{"$f":"IF($J13<>\"\",VLOOKUP($D13,[1]Database!$E$6:$BI$15000,T$9,0),\"\")","v":""},null,{"$f":"UPPER(IF(J13<>\"\",D13&\"-\"&LEFT(L13,11),\"\"))","v":""},"","","","",{"$f":"UPPER(IF($J13<>\"\",$E13&\"-\"&$S13&\"-\"&LEFT($T13,7),\"\"))","v":""},{"$f":"Y13","v":""},{"$f":"UPPER(IF($J13<>\"\",\nVLOOKUP($J13,[1]Database!$B$6:$BI$15000,AC$4,0)&\"-\"&\nVLOOKUP($J13,[1]Database!$B$6:$BI$15000,AC$5,0)&\"-\"&\nVLOOKUP($J13,[1]Database!$B$6:$BI$15000,AC$6,0)&\"-\"&\nVLOOKUP($J13,[1]Database!$B$6:$BI$15000,AC$7,0)&\"-\"&\nVLOOKUP($J13,[1]Database!$B$6:$BI$15000,AC$8,0),\n\"\"))","v":""}]
[null,null,3,null,"",null,"","","","",null,{"$f":"IF($J14<>\"\",VLOOKUP($D14,[1]Database!$E$6:$BI$15000,L$9,0),\"\")","v":""},{"$f":"IF($J14<>\"\",VLOOKUP($J14,[1]Database!$B$6:$BI$15000,M$9,0),\"\")","v":""},{"$f":"IF($J14<>\"\",VLOOKUP($J14,[1]Database!$B$6:$BI$15000,N$9,0),\"\")","v":""},{"$f":"IF($J14<>\"\",M14+'[1]Calc Inputs'!$D$20,\"\")","v":""},{"$f":"IF($J14<>\"\",N14+'[1]Calc Inputs'!$D$24,\"\")","v":""},{"$f":"IF($J14<>\"\",VLOOKUP($J14,[1]Database!$B$6:$BI$15000,Q$9,0),\"\")","v":""},{"$f":"IF($J14<>\"\",VLOOKUP($J14,[1]Database!$B$6:$BI$15000,R$9,0),\"\")","v":""},{"$f":"IF($J14<>\"\",VLOOKUP($J14,[1]Database!$B$6:$BI$15000,S$9,0),\"\")","v":""},{"$f":"IF($J14<>\"\",VLOOKUP($D14,[1]Database!$E$6:$BI$15000,T$9,0),\"\")","v":""},null,"","","","","","","",{"$f":"UPPER(IF($J14<>\"\",\nVLOOKUP($J14,[1]Database!$B$6:$BI$15000,AC$4,0)&\"-\"&\nVLOOKUP($J14,[1]Database!$B$6:$BI$15000,AC$5,0)&\"-\"&\nVLOOKUP($J14,[1]Database!$B$6:$BI$15000,AC$6,0)&\"-\"&\nVLOOKUP($J14,[1]Database!$B$6:$BI$15000,AC$7,0)&\"-\"&\nVLOOKUP($J14,[1]Database!$B$6:$BI$15000,AC$8,0),\n\"\"))","v":""}]
[null,null,4,null,"",null,"","","","",null,{"$f":"IF($J15<>\"\",VLOOKUP($D15,[1]Database!$E$6:$BI$15000,L$9,0),\"\")","v":""},{"$f":"IF($J15<>\"\",VLOOKUP($J15,[1]Database!$B$6:$BI$15000,M$9,0),\"\")","v":""},{"$f":"IF($J15<>\"\",VLOOKUP($J15,[1]Database!$B$6:$BI$15000,N$9,0),\"\")","v":""},{"$f":"IF($J15<>\"\",M15+'[1]Calc Inputs'!$D$20,\"\")","v":""},{"$f":"IF($J15<>\"\",N15+'[1]Calc Inputs'!$D$24,\"\")","v":""},{"$f":"IF($J15<>\"\",VLOOKUP($J15,[1]Database!$B$6:$BI$15000,Q$9,0),\"\")","v":""},{"$f":"IF($J15<>\"\",VLOOKUP($J15,[1]Database!$B$6:$BI$15000,R$9,0),\"\")","v":""},{"$f":"IF($J15<>\"\",VLOOKUP($J15,[1]Database!$B$6:$BI$15000,S$9,0),\"\")","v":""},{"$f":"IF($J15<>\"\",VLOOKUP($D15,[1]Database!$E$6:$BI$15000,T$9,0),\"\")","v":""},null,"","","","","","","",{"$f":"UPPER(IF($J15<>\"\",\nVLOOKUP($J15,[1]Database!$B$6:$BI$15000,AC$4,0)&\"-\"&\nVLOOKUP($J15,[1]Database!$B$6:$BI$15000,AC$5,0)&\"-\"&\nVLOOKUP($J15,[1]Database!$B$6:$BI$15000,AC$6,0)&\"-\"&\nVLOOKUP($J15,[1]Database!$B$6:$BI$15000,AC$7,0)&\"-\"&\nVLOOKUP($J15,[1]Database!$B$6:$BI$15000,AC$8,0),\n\"\"))","v":""}]
[null,null,5,null,"",null,"","","","",null,{"$f":"IF($J16<>\"\",VLOOKUP($D16,[1]Database!$E$6:$BI$15000,L$9,0),\"\")","v":""},{"$f":"IF($J16<>\"\",VLOOKUP($J16,[1]Database!$B$6:$BI$15000,M$9,0),\"\")","v":""},{"$f":"IF($J16<>\"\",VLOOKUP($J16,[1]Database!$B$6:$BI$15000,N$9,0),\"\")","v":""},{"$f":"IF($J16<>\"\",M16+'[1]Calc Inputs'!$D$20,\"\")","v":""},{"$f":"IF($J16<>\"\",N16+'[1]Calc Inputs'!$D$24,\"\")","v":""},{"$f":"IF($J16<>\"\",VLOOKUP($J16,[1]Database!$B$6:$BI$15000,Q$9,0),\"\")","v":""},{"$f":"IF($J16<>\"\",VLOOKUP($J16,[1]Database!$B$6:$BI$15000,R$9,0),\"\")","v":""},{"$f":"IF($J16<>\"\",VLOOKUP($J16,[1]Database!$B$6:$BI$15000,S$9,0),\"\")","v":""},{"$f":"IF($J16<>\"\",VLOOKUP($D16,[1]Database!$E$6:$BI$15000,T$9,0),\"\")","v":""},null,"","","","","","","",{"$f":"UPPER(IF($J16<>\"\",\nVLOOKUP($J16,[1]Database!$B$6:$BI$15000,AC$4,0)&\"-\"&\nVLOOKUP($J16,[1]Database!$B$6:$BI$15000,AC$5,0)&\"-\"&\nVLOOKUP($J16,[1]Database!$B$6:$BI$15000,AC$6,0)&\"-\"&\nVLOOKUP($J16,[1]Database!$B$6:$BI$15000,AC$7,0)&\"-\"&\nVLOOKUP($J16,[1]Database!$B$6:$BI$15000,AC$8,0),\n\"\"))","v":""}]
[null,null,6,null,"",null,"","","","",null,{"$f":"IF($J17<>\"\",VLOOKUP($D17,[1]Database!$E$6:$BI$15000,L$9,0),\"\")","v":""},{"$f":"IF($J17<>\"\",VLOOKUP($J17,[1]Database!$B$6:$BI$15000,M$9,0),\"\")","v":""},{"$f":"IF($J17<>\"\",VLOOKUP($J17,[1]Database!$B$6:$BI$15000,N$9,0),\"\")","v":""},{"$f":"IF($J17<>\"\",M17+'[1]Calc Inputs'!$D$20,\"\")","v":""},{"$f":"IF($J17<>\"\",N17+'[1]Calc Inputs'!$D$24,\"\")","v":""},{"$f":"IF($J17<>\"\",VLOOKUP($J17,[1]Database!$B$6:$BI$15000,Q$9,0),\"\")","v":""},{"$f":"IF($J17<>\"\",VLOOKUP($J17,[1]Database!$B$6:$BI$15000,R$9,0),\"\")","v":""},{"$f":"IF($J17<>\"\",VLOOKUP($J17,[1]Database!$B$6:$BI$15000,S$9,0),\"\")","v":""},{"$f":"IF($J17<>\"\",VLOOKUP($D17,[1]Database!$E$6:$BI$15000,T$9,0),\"\")","v":""},null,"","","","","","","",{"$f":"UPPER(IF($J17<>\"\",\nVLOOKUP($J17,[1]Database!$B$6:$BI$15000,AC$4,0)&\"-\"&\nVLOOKUP($J17,[1]Database!$B$6:$BI$15000,AC$5,0)&\"-\"&\nVLOOKUP($J17,[1]Database!$B$6:$BI$15000,AC$6,0)&\"-\"&\nVLOOKUP($J17,[1]Database!$B$6:$BI$15000,AC$7,0)&\"-\"&\nVLOOKUP($J17,[1]Database!$B$6:$BI$15000,AC$8,0),\n\"\"))","v":""}]
[null,null,7,null,"",null,"","","","",null,{"$f":"IF($J18<>\"\",VLOOKUP($D18,[1]Database!$E$6:$BI$15000,L$9,0),\"\")","v":""},{"$f":"IF($J18<>\"\",VLOOKUP($J18,[1]Database!$B$6:$BI$15000,M$9,0),\"\")","v":""},{"$f":"IF($J18<>\"\",VLOOKUP($J18,[1]Database!$B$6:$BI$15000,N$9,0),\"\")","v":""},{"$f":"IF($J18<>\"\",M18+'[1]Calc Inputs'!$D$20,\"\")","v":""},{"$f":"IF($J18<>\"\",N18+'[1]Calc Inputs'!$D$24,\"\")","v":""},{"$f":"IF($J18<>\"\",VLOOKUP($J18,[1]Database!$B$6:$BI$15000,Q$9,0),\"\")","v":""},{"$f":"IF($J18<>\"\",VLOOKUP($J18,[1]Database!$B$6:$BI$15000,R$9,0),\"\")","v":""},{"$f":"IF($J18<>\"\",VLOOKUP($J18,[1]Database!$B$6:$BI$15000,S$9,0),\"\")","v":""},{"$f":"IF($J18<>\"\",VLOOKUP($D18,[1]Database!$E$6:$BI$15000,T$9,0),\"\")","v":""},null,"","","","","","","",{"$f":"UPPER(IF($J18<>\"\",\nVLOOKUP($J18,[1]Database!$B$6:$BI$15000,AC$4,0)&\"-\"&\nVLOOKUP($J18,[1]Database!$B$6:$BI$15000,AC$5,0)&\"-\"&\nVLOOKUP($J18,[1]Database!$B$6:$BI$15000,AC$6,0)&\"-\"&\nVLOOKUP($J18,[1]Database!$B$6:$BI$15000,AC$7,0)&\"-\"&\nVLOOKUP($J18,[1]Database!$B$6:$BI$15000,AC$8,0),\n\"\"))","v":""}]
[null,null,8,null,"",null,"","","","",null,{"$f":"IF($J19<>\"\",VLOOKUP($D19,[1]Database!$E$6:$BI$15000,L$9,0),\"\")","v":""},{"$f":"IF($J19<>\"\",VLOOKUP($J19,[1]Database!$B$6:$BI$15000,M$9,0),\"\")","v":""},{"$f":"IF($J19<>\"\",VLOOKUP($J19,[1]Database!$B$6:$BI$15000,N$9,0),\"\")","v":""},{"$f":"IF($J19<>\"\",M19+'[1]Calc Inputs'!$D$20,\"\")","v":""},{"$f":"IF($J19<>\"\",N19+'[1]Calc Inputs'!$D$24,\"\")","v":""},{"$f":"IF($J19<>\"\",VLOOKUP($J19,[1]Database!$B$6:$BI$15000,Q$9,0),\"\")","v":""},{"$f":"IF($J19<>\"\",VLOOKUP($J19,[1]Database!$B$6:$BI$15000,R$9,0),\"\")","v":""},{"$f":"IF($J19<>\"\",VLOOKUP($J19,[1]Database!$B$6:$BI$15000,S$9,0),\"\")","v":""},{"$f":"IF($J19<>\"\",VLOOKUP($D19,[1]Database!$E$6:$BI$15000,T$9,0),\"\")","v":""},null,"","","","","","","",{"$f":"UPPER(IF($J19<>\"\",\nVLOOKUP($J19,[1]Database!$B$6:$BI$15000,AC$4,0)&\"-\"&\nVLOOKUP($J19,[1]Database!$B$6:$BI$15000,AC$5,0)&\"-\"&\nVLOOKUP($J19,[1]Database!$B$6:$BI$15000,AC$6,0)&\"-\"&\nVLOOKUP($J19,[1]Database!$B$6:$BI$15000,AC$7,0)&\"-\"&\nVLOOKUP($J19,[1]Database!$B$6:$BI$15000,AC$8,0),\n\"\"))","v":""}]
[null,null,9,null,"",null,"","","","",null,{"$f":"IF($J20<>\"\",VLOOKUP($D20,[1]Database!$E$6:$BI$15000,L$9,0),\"\")","v":""},{"$f":"IF($J20<>\"\",VLOOKUP($J20,[1]Database!$B$6:$BI$15000,M$9,0),\"\")","v":""},{"$f":"IF($J20<>\"\",VLOOKUP($J20,[1]Database!$B$6:$BI$15000,N$9,0),\"\")","v":""},{"$f":"IF($J20<>\"\",M20+'[1]Calc Inputs'!$D$20,\"\")","v":""},{"$f":"IF($J20<>\"\",N20+'[1]Calc Inputs'!$D$24,\"\")","v":""},{"$f":"IF($J20<>\"\",VLOOKUP($J20,[1]Database!$B$6:$BI$15000,Q$9,0),\"\")","v":""},{"$f":"IF($J20<>\"\",VLOOKUP($J20,[1]Database!$B$6:$BI$15000,R$9,0),\"\")","v":""},{"$f":"IF($J20<>\"\",VLOOKUP($J20,[1]Database!$B$6:$BI$15000,S$9,0),\"\")","v":""},{"$f":"IF($J20<>\"\",VLOOKUP($D20,[1]Database!$E$6:$BI$15000,T$9,0),\"\")","v":""},null,"","","","","","","",{"$f":"UPPER(IF($J20<>\"\",\nVLOOKUP($J20,[1]Database!$B$6:$BI$15000,AC$4,0)&\"-\"&\nVLOOKUP($J20,[1]Database!$B$6:$BI$15000,AC$5,0)&\"-\"&\nVLOOKUP($J20,[1]Database!$B$6:$BI$15000,AC$6,0)&\"-\"&\nVLOOKUP($J20,[1]Database!$B$6:$BI$15000,AC$7,0)&\"-\"&\nVLOOKUP($J20,[1]Database!$B$6:$BI$15000,AC$8,0),\n\"\"))","v":""}]
{"$rows_left_out":53}
{"sheet":"Track Export 1","index":2,"n_rows":163,"n_cols":4,"rows_kept":163,"cut":false,"hidden":false,"merged":[]}
["R2000",{"$f":"Inputs!AB12","v":""},"+",1]
["R2002",{"$f":"Inputs!W12","v":""},"+",1]
["R2003",{"$f":"Inputs!X12","v":""},"+",1]
["R2004",{"$f":"Inputs!AA12","v":""},"ST",32]
["R2022",{"$f":"Inputs!V12","v":""},"ST",16]
["R2032",{"$f":"Inputs!AC12","v":""},"ST",32]
["R2049",0,null,1]
["R2050",{"$f":"Inputs!AB13","v":""},"+",1]
["R2052",{"$f":"Inputs!W13","v":""},"+",1]
["R2053",{"$f":"Inputs!X13","v":""},"+",1]
["R2054",{"$f":"Inputs!AA13","v":""},"ST",32]
["R2072",{"$f":"Inputs!V13","v":""},"ST",16]
["R2082",{"$f":"Inputs!AC13","v":""},"ST",32]
["R2099",0,null,1]
["R2100",{"$f":"Inputs!AB14","v":""},"+",1]
["R2102",{"$f":"Inputs!W14","v":""},"+",1]
["R2103",{"$f":"Inputs!X14","v":""},"+",1]
["R2104",{"$f":"Inputs!AA14","v":""},"ST",32]
["R2122",{"$f":"Inputs!V14","v":""},"ST",16]
["R2132",{"$f":"Inputs!AC14","v":""},"ST",32]
{"$rows_left_out":144}
{"sheet":"Track Export 2","index":3,"n_rows":163,"n_cols":4,"rows_kept":163,"cut":false,"hidden":false,"merged":[]}
["R2000",{"$f":"Inputs!AB32","v":""},"+",1]
["R2002",{"$f":"Inputs!W32","v":""},"+",1]
["R2003",{"$f":"Inputs!X32","v":""},"+",1]
["R2004",{"$f":"Inputs!AA32","v":""},"ST",32]
["R2022",{"$f":"Inputs!V32","v":""},"ST",16]
["R2032",{"$f":"Inputs!AC32","v":""},"ST",32]
["R2049",0,null,1]
["R2050",{"$f":"Inputs!AB33","v":""},"+",1]
["R2052",{"$f":"Inputs!W33","v":""},"+",1]
["R2053",{"$f":"Inputs!X33","v":""},"+",1]
["R2054",{"$f":"Inputs!AA33","v":""},"ST",32]
["R2072",{"$f":"Inputs!V33","v":""},"ST",16]
["R2082",{"$f":"Inputs!AC33","v":""},"ST",32]
["R2099",0,null,1]
["R2100",{"$f":"Inputs!AB34","v":""},"+",1]
["R2102",{"$f":"Inputs!W34","v":""},"+",1]
["R2103",{"$f":"Inputs!X34","v":""},"+",1]
["R2104",{"$f":"Inputs!AA34","v":""},"ST",32]
["R2122",{"$f":"Inputs!V34","v":""},"ST",16]
["R2132",{"$f":"Inputs!AC34","v":""},"ST",32]
{"$rows_left_out":144}
{"sheet":"Track Export 3","index":4,"n_rows":163,"n_cols":4,"rows_kept":163,"cut":false,"hidden":false,"merged":[]}
["R2000",{"$f":"Inputs!AB52","v":""},"+",1]
["R2002",{"$f":"Inputs!W52","v":""},"+",1]
["R2003",{"$f":"Inputs!X52","v":""},"+",1]
["R2004",{"$f":"Inputs!AA52","v":""},"ST",32]
["R2022",{"$f":"Inputs!V52","v":""},"ST",16]
["R2032",{"$f":"Inputs!AC52","v":""},"ST",32]
["R2049",0,null,1]
["R2050",{"$f":"Inputs!AB53","v":""},"+",1]
["R2052",{"$f":"Inputs!W53","v":""},"+",1]
["R2053",{"$f":"Inputs!X53","v":""},"+",1]
["R2054",{"$f":"Inputs!AA53","v":""},"ST",32]
["R2072",{"$f":"Inputs!V53","v":""},"ST",16]
["R2082",{"$f":"Inputs!AC53","v":""},"ST",32]
["R2099",0,null,1]
["R2100",{"$f":"Inputs!AB54","v":""},"+",1]
["R2102",{"$f":"Inputs!W54","v":""},"+",1]
["R2103",{"$f":"Inputs!X54","v":""},"+",1]
["R2104",{"$f":"Inputs!AA54","v":""},"ST",32]
["R2122",{"$f":"Inputs!V54","v":""},"ST",16]
["R2132",{"$f":"Inputs!AC54","v":""},"ST",32]
{"$rows_left_out":143}